Current cvs build failure

Peter Nixon listuser at
Mon May 7 17:42:16 CEST 2007

/usr/src/packages/BUILD/freeradius-server-snapshot-20070507/libtool --mode=link 
gcc -export-dynamic -dlopen self \
		 -pie  -o radiusd acct.lo auth.lo client.lo conffile.lo crypt.lo exec.lo 
files.lo listen.lo log.lo mainconfig.lo modules.lo modcall.lo radiusd.lo 
radius_snmp.lo session.lo smux.lo threads.lo util.lo valuepair.lo version.lo 
xlat.lo event.lo realms.lo      \
		 ../lib/ -lnsl -lresolv  -lpthread -lsnmp \
		-lcrypt  -lltdl -lcrypto -lssl -lcrypto
rm -f .libs/radiusd.nm .libs/radiusd.nmS .libs/radiusd.nmT
creating .libs/radiusdS.c
(cd .libs && 
gcc  -fmessage-length=0 -D_FORTIFY_SOURCE=2 -O2 -fno-strict-aliasing -DLDAP_DEPRECATED -fPIC -DPIC -c -fno-builtin "radiusdS.c")
rm -f .libs/radiusdS.c .libs/radiusd.nm .libs/radiusd.nmS .libs/radiusd.nmT
gcc .libs/radiusdS.o -pie -o .libs/radiusd .libs/acct.o .libs/auth.o .libs/client.o .libs/conffile.o .libs/crypt.o .libs/exec.o .libs/files.o .libs/listen.o .libs/log.o .libs/mainconfig.o .libs/modules.o .libs/modcall.o .libs/radiusd.o .libs/radius_snmp.o .libs/session.o .libs/smux.o .libs/threads.o .libs/util.o .libs/valuepair.o .libs/version.o .libs/xlat.o .libs/event.o .libs/realms.o -Wl,--export-dynamic  ../lib/.libs/ -lnsl -lresolv -lpthread /usr/lib64/ -lcrypt /usr/lib64/ -ldl -lssl -lcrypto  -Wl,--rpath -Wl,/usr/lib64/freeradius
.libs/radius_snmp.o: In function `radServReset':
radius_snmp.c:(.text+0x943): undefined reference to `need_reload'
collect2: ld returned 1 exit status
gmake[4]: *** [radiusd] Error 1
gmake[4]: Leaving directory 
gmake[3]: *** [common] Error 2
gmake[3]: Leaving directory 
gmake[2]: *** [all] Error 2
gmake[2]: Leaving directory 
gmake[1]: *** [common] Error 2
gmake[1]: Leaving directory 
make: *** [all] Error 2
error: Bad exit status from /var/tmp/rpm-tmp.83516 (%build)


Peter Nixon
PGP Key:

More information about the Freeradius-Devel mailing list