Install freeradius 1.1.1 get error

杨呈飞 yangchengfei at
Tue Apr 4 04:44:04 CEST 2006


 ./configure ¨Cprefix=/usr/local/freeradius


 make install


I get:

/home/test/freeradius-1.1.1/install-sh -c -c .libs/

(cd /usr/local/freeradius && rm -f && ln -s

/home/test/freeradius-1.1.1/install-sh -c -c .libs/libradius.lai

/home/test/freeradius-1.1.1/install-sh -c -c .libs/libradius.a

ranlib /usr/local/freeradius/libradius.a

chmod 644 /usr/local/freeradius/libradius.a

libtool: install: warning: remember to run `libtool --finish

rm -f /usr/local/freeradius/lib/;

ln -s /usr/local/freeradius/lib/

ln: creating symbolic link `/usr/local/freeradius/lib/' to
`': No such file or directory

gmake[4]: *** [install] Error 1

gmake[4]: Leaving directory `/home/test/freeradius-1.1.1/src/lib'

gmake[3]: *** [common] Error 2

gmake[3]: Leaving directory `/home/test/freeradius-1.1.1/src'

gmake[2]: *** [install] Error 2

gmake[2]: Leaving directory `/home/test/freeradius-1.1.1/src'

gmake[1]: *** [common] Error 2

gmake[1]: Leaving directory `/home/test/freeradius-1.1.1'

make: *** [install] Error 2


how can I fix that?



-------------- next part --------------
An HTML attachment was scrubbed...
URL: <>

More information about the Freeradius-Users mailing list