Install problems

Breuer Nicolas Nicolas.Breuer at
Mon Jan 17 12:03:20 CET 2011


 I just do that.

MAKE            = /usr/bin/gmake
CC              = gcc
RANLIB          = ranlib
INCLUDE         =
CFLAGS          = $(INCLUDE) -g -O2 -D_REENTRANT -

 Same error

libtool: compile:  gcc -g -O2 -D_REENTRANT -D_POSIX_PTHREAD_SEMANTICS -Wall -
D_GNU_SOURCE -DNDEBUG -DIE_LIBTOOL_DIE -I/var/instapp/freeradius-server-
2.1.10/src -DHOSTINFO=\"x86_64-unknown-linux-gnu\" -DRADIUSD_VERSION=\"2.1.10\" 
-DNO_OPENSSL -c detail.c  -fPIC -DPIC -o .libs/detail.o
libtool: compile:  gcc -g -O2 -D_REENTRANT -D_POSIX_PTHREAD_SEMANTICS -Wall -
D_GNU_SOURCE -DNDEBUG -DIE_LIBTOOL_DIE -I/var/instapp/freeradius-server-
2.1.10/src -DHOSTINFO=\"x86_64-unknown-linux-gnu\" -DRADIUSD_VERSION=\"2.1.10\" 
-DNO_OPENSSL -c detail.c -o detail.o >/dev/null 2>&1
/usr/bin/libtool --mode=link gcc -export-dynamic -dlopen self \
          -o radiusd acct.lo auth.lo client.lo conffile.lo crypt.lo exec.lo files.lo listen.lo log.lo 
mainconfig.lo modules.lo modcall.lo radiusd.lo stats.lo session.lo threads.lo util.lo 
valuepair.lo version.lo xlat.lo event.lo realms.lo evaluate.lo vmps.lo detail.lo      \
         /var/instapp/freeradius-server-2.1.10/src/lib/ -lnsl -lresolv  -
lpthread  \
        -lcrypt  /var/instapp/freeradius-server-2.1.10/libltdl/ 
libtool: link: rm -f .libs/radiusd.nm .libs/radiusd.nmS .libs/radiusd.nmT
libtool: link: (cd .libs && gcc -O2 -g -pipe -Wall -Wp,-D_FORTIFY_SOURCE=2 -fexceptions 
-fstack-protector --param=ssp-buffer-size=4 -m64 -mtune=generic -fPIC -c -fno-builtin 
libtool: link: rm -f ".libs/radiusdS.c" ".libs/radiusd.nm" ".libs/radiusd.nmS" ".libs/radiusd.nmT"
libtool: link: gcc .libs/radiusdS.o -o .libs/radiusd .libs/acct.o .libs/auth.o .libs/client.o 
.libs/conffile.o .libs/crypt.o .libs/exec.o .libs/files.o .libs/listen.o .libs/log.o .libs/mainconfig.o 
.libs/modules.o .libs/modcall.o .libs/radiusd.o .libs/stats.o .libs/session.o .libs/threads.o 
.libs/util.o .libs/valuepair.o .libs/version.o .libs/xlat.o .libs/event.o .libs/realms.o 
.libs/evaluate.o .libs/vmps.o .libs/detail.o -Wl,--export-dynamic  /var/instapp/freeradius-
server-2.1.10/src/lib/.libs/ -lnsl -lresolv -lpthread -lcrypt 
/var/instapp/freeradius-server-2.1.10/libltdl/.libs/ -ldl  -Wl,-rpath -
.libs/modules.o: In function `setup_modules':
/var/instapp/freeradius-server-2.1.10/src/main/modules.c:1372: undefined reference to 
collect2: ld returned 1 exit status
gmake[4]: *** [radiusd] Error 1
gmake[4]: Leaving directory `/var/instapp/freeradius-server-2.1.10/src/main'
gmake[3]: *** [main] Error 2
gmake[3]: Leaving directory `/var/instapp/freeradius-server-2.1.10/src'
gmake[2]: *** [all] Error 2

Date sent:      	Mon, 17 Jan 2011 11:57:47 +0100
From:           	Alan DeKok <aland at>
To:             	Nicolas.Breuer at,
       	FreeRadius users mailing list <freeradius-users at>
Subject:        	Re: Install problems

> Breuer Nicolas wrote:
> >  I can't install the last freeradius to our new server
> > 
> >   ./configure --libdir=/usr/local/lib/freeradius2
> > --with-mysql-lib-dir=/usr/lib64/mysql --disable-libltdl-install
> > --with-system-libtool --without-openssl
> ...
> > /var/instapp/freeradius-server-2.1.10/src/main/modules.c:1372: undefined
> > reference to `lt_preloaded_symbols'
>   Edit the file, and find the line starting with "CFLAGS".  Add
> a " -DIE_LIBTOOL_DIE" to the end.  Do "make clean", followed by "make".
>   Alan DeKok.

-------------- next part --------------
An HTML attachment was scrubbed...
URL: <>

More information about the Freeradius-Users mailing list