Proposed release of 2.1.6

Arran Cudbard-Bell A.Cudbard-Bell at
Tue May 12 18:37:25 CEST 2009

On 12/5/09 14:33, Alan DeKok wrote:
>    We plan on releasing 2.1.6 this week.
>    Please test the pre release at:
>    If there are any concerns, problems, errors, etc., please let us know
> before we release the final version.
>    Alan DeKok.
> -
> List info/subscribe/unsubscribe? See

/usr/local/tmp-src/freeradius-server-2.1.6/libtool --mode=link gcc 
-export-dynamic -dlopen self \
	  -o radiusd acct.lo auth.lo client.lo conffile.lo crypt.lo exec.lo 
files.lo listen.lo log.lo mainconfig.lo modules.lo modcall.l
-framework DirectoryService -lresolv  -lpthread  \
	  -lltdl -lcrypto -lssl -lcrypto
rm -f .libs/radiusd.nm .libs/radiusd.nmS .libs/radiusd.nmT
creating .libs/radiusdS.c
(cd .libs && gcc  -g -O2 -c -fno-builtin "radiusdS.c")
rm -f .libs/radiusdS.c .libs/radiusd.nm .libs/radiusd.nmS .libs/radiusd.nmT
gcc .libs/radiusdS.o -o .libs/radiusd .libs/acct.o .libs/auth.o 
.libs/client.o .libs/conffile.o .libs/crypt.o .libs/exec.o .libs/files.o
/usr/libexec/gcc/powerpc-apple-darwin8/4.0.1/ld: Undefined symbols:
collect2: ld returned 1 exit status
make[4]: *** [radiusd] Error 1
make[3]: *** [common] Error 2
make[2]: *** [all] Error 2
make[1]: *** [common] Error 2
make: *** [all] Error 2

Hmm maybe the directory services stuff only compiles correctly in 10.5

Arran Cudbard-Bell (A.Cudbard-Bell at,
Authentication, Authorisation and Accounting Officer,
Infrastructure Services (IT Services),
E1-1-08, Engineering 1, University Of Sussex, Brighton, BN1 9QT
DDI+FAX: +44 1273 873900 | INT: 3900
GPG: 86FF A285 1AA1 EE40 D228 7C2E 71A9 25BB 1E68 54A2

More information about the Freeradius-Users mailing list